BDBM50362324 CHEMBL1939944
SMILES CN1CC[C@H](NC(=O)C[C@H]2N(C=CNC2=O)S(=O)(=O)c2cccc(Cl)c2Cl)C(C)(C)C1
InChI Key InChIKey=GSKXNWNINZYLJK-ZBFHGGJFSA-N
Data  1 IC50
  Tab Delimited (TSV)   2D SDfile   Computed 3D by Vconf -m prep SDfile
Find this compound or compounds like it in BindingDB:
Activity Spreadsheet -- Enzyme Inhibition Constant Data from BindingDB
Found 1 hit for monomerid = 50362324
TargetB1 bradykinin receptor(Homo sapiens (Human))
Amgen
Curated by ChEMBL
LigandPNGBDBM50362324(CHEMBL1939944)
Affinity DataIC50:  0.220nM. Assay description: Antagonist activity at human bradykinin B1 receptor expressed in CHO-D-/aequorin cells assessed as inhibition of DAK-induced intracellular calcium le...
In DepthDetails ArticlePubMed