BDBM50362514 CHEMBL1940982
SMILES C[C@H]1COc2c(NCCCn3ccnc3)c(F)c(N)c3c2n1cc(C(O)=O)c3=O
InChI Key InChIKey=QBRXLCMDYVGYLD-JTQLQIEISA-N
Data  1 IC50
  Tab Delimited (TSV)   2D SDfile   Computed 3D by Vconf -m prep SDfile
Find this compound or compounds like it in BindingDB:
Activity Spreadsheet -- Enzyme Inhibition Constant Data from BindingDB
Found 1 hit for monomerid = 50362514
TargetGlycogen synthase kinase-3 beta(Homo sapiens (Human))
Activx Biosciences
Curated by ChEMBL
LigandPNGBDBM50362514(CHEMBL1940982)
Affinity DataIC50:  150nM. Assay description: Inhibition of GSK3-beta
In DepthDetails ArticlePubMed