BDBM50362722 CHEMBL1939800
SMILES COc1cc(C)c2nc3[nH]nc(C)c3c(NCc3ccncc3)c2c1
InChI Key InChIKey=WVFZLLHYILMVBO-UHFFFAOYSA-N
Data  1 KI
  Tab Delimited (TSV)   2D SDfile   Computed 3D by Vconf -m prep SDfile
Find this compound or compounds like it in BindingDB:
Activity Spreadsheet -- Enzyme Inhibition Constant Data from BindingDB
Found 1 hit for monomerid = 50362722
TargetcAMP and cAMP-inhibited cGMP 3',5'-cyclic phosphodiesterase 10A(Homo sapiens (Human))
Merck Research Laboratories
Curated by ChEMBL
LigandPNGBDBM50362722(CHEMBL1939800)
Affinity DataKi:  0.600nM. Assay description: Inhibition of recombinant human PDE10A using [3H]cAMP as substrate by scintillation proximity assay
In DepthDetails ArticlePubMed