BDBM50362948 CHEMBL1947146
SMILES COc1ccc2c(noc2c1)-n1c2ccccc2n(Cc2cc(O[C@H](C)C(O)=O)ccc2Cl)c1=O
InChI Key InChIKey=MHWFCZPGHYGQMR-CQSZACIVSA-N
Data  3 IC50  5 EC50
  Tab Delimited (TSV)   2D SDfile   Computed 3D by Vconf -m prep SDfile
Find this compound or compounds like it in BindingDB:
Activity Spreadsheet -- Enzyme Inhibition Constant Data from BindingDB
Found 8 hits for monomerid = 50362948
TargetPeroxisome proliferator-activated receptor gamma(Homo sapiens (Human))
Merck Research Laboratories
Curated by ChEMBL
LigandPNGBDBM50362948(CHEMBL1947146)
Affinity DataEC50:  8nM. Assay description: Partial agonist activity at human PPARgamma LBD assessed as activation of PGC1 by HTRF assay
In DepthDetails ArticlePubMed
TargetPeroxisome proliferator-activated receptor gamma(Homo sapiens (Human))
Merck Research Laboratories
Curated by ChEMBL
LigandPNGBDBM50362948(CHEMBL1947146)
Affinity DataEC50: >5.00E+4nM. Assay description: Partial agonist activity at human PPARgamma LBD assessed as activation of Src-1 by HTRF assay
In DepthDetails ArticlePubMed
TargetPeroxisome proliferator-activated receptor gamma(Homo sapiens (Human))
Merck Research Laboratories
Curated by ChEMBL
LigandPNGBDBM50362948(CHEMBL1947146)
Affinity DataEC50:  11nM. Assay description: Partial agonist activity at human PPARgamma LBD assessed as activation of PBP by HTRF assay
In DepthDetails ArticlePubMed
TargetPeroxisome proliferator-activated receptor delta(Homo sapiens (Human))
Merck Research Laboratories
Curated by ChEMBL
LigandPNGBDBM50362948(CHEMBL1947146)
Affinity DataIC50: >5.00E+4nM. Assay description: Binding affinity to PPARdelta by scintillation proximity assay
In DepthDetails ArticlePubMed
TargetPeroxisome proliferator-activated receptor gamma(Homo sapiens (Human))
Merck Research Laboratories
Curated by ChEMBL
LigandPNGBDBM50362948(CHEMBL1947146)
Affinity DataEC50:  11nM. Assay description: Partial agonist activity at human PPARgamma LBD assessed as activation of CBP1-453 by HTRF assay
In DepthDetails ArticlePubMed
TargetPeroxisome proliferator-activated receptor gamma(Homo sapiens (Human))
Merck Research Laboratories
Curated by ChEMBL
LigandPNGBDBM50362948(CHEMBL1947146)
Affinity DataEC50:  51.1nM. Assay description: Agonist activity at human PPARgamma expressed in COS-1 cells co-expressing with Gal4 by transactivation assay
In DepthDetails ArticlePubMed
TargetPeroxisome proliferator-activated receptor alpha(Homo sapiens (Human))
Merck Research Laboratories
Curated by ChEMBL
LigandPNGBDBM50362948(CHEMBL1947146)
Affinity DataIC50: >5.00E+4nM. Assay description: Binding affinity to human PPARalpha expressed in COS-1 by scintillation proximity assay
In DepthDetails ArticlePubMed
TargetPeroxisome proliferator-activated receptor gamma(Homo sapiens (Human))
Merck Research Laboratories
Curated by ChEMBL
LigandPNGBDBM50362948(CHEMBL1947146)
Affinity DataIC50:  13.7nM. Assay description: Binding affinity to human PPARgamma by scintillation proximity assay
In DepthDetails ArticlePubMed