BDBM50363001 CHEMBL1946137
SMILES C[C@H](CO)NC1=Nc2ccc(F)cc2S(=O)(=O)N1
InChI Key InChIKey=WEQMMWSFTJCXJC-ZCFIWIBFSA-N
Data  1 IC50
  Tab Delimited (TSV)   2D SDfile   Computed 3D by Vconf -m prep SDfile
Find this compound or compounds like it in BindingDB:
Activity Spreadsheet -- Enzyme Inhibition Constant Data from BindingDB
Found 1 hit for monomerid = 50363001
TargetATP-binding cassette sub-family C member 8(Rattus norvegicus)
Universit£
Curated by ChEMBL
LigandPNGBDBM50363001(CHEMBL1946137)
Affinity DataIC50:  2.05E+3nM. Assay description: Activation of SUR1 in rat pancreatic islets assessed as inhibition of glucose-induced insulin secretion
In DepthDetails ArticlePubMed