BDBM50363048 CHEMBL1946423
SMILES FC(F)(F)CCC(=O)N1CCC(CC1)c1nnc(o1)-c1ccccc1
InChI Key InChIKey=WXVXDMOILHLXPD-UHFFFAOYSA-N
Data  1 EC50
  Tab Delimited (TSV)   2D SDfile   Computed 3D by Vconf -m prep SDfile
Find this compound or compounds like it in BindingDB:
Activity Spreadsheet -- Enzyme Inhibition Constant Data from BindingDB
Found 1 hit for monomerid = 50363048
TargetHTH-type transcriptional regulator EthR(Mycobacterium tuberculosis)
University Of Lille
Curated by ChEMBL
LigandPNGBDBM50363048(CHEMBL1946423)
Affinity DataEC50: >5.00E+3nM. Assay description: Inhibition of Mycobacterium tuberculosis H37Rv EthR in Mycobacterium tuberculosis H37Rv expressing GFP infected mouse in RAW264.7 cells assessed as p...
In DepthDetails ArticlePubMed