BDBM50363258 CHEMBL1944712
SMILES Fc1ccc2c(CN(c3cccc(Cl)c3)c3ccccn3)cc(=O)[nH]c2c1F
InChI Key InChIKey=JLGHPGGDKLOKAZ-UHFFFAOYSA-N
Data  3 IC50
  Tab Delimited (TSV)   2D SDfile   Computed 3D by Vconf -m prep SDfile
Find this compound or compounds like it in BindingDB:
Activity Spreadsheet -- Enzyme Inhibition Constant Data from BindingDB
Found 3 hits for monomerid = 50363258
TargetNitric oxide synthase, endothelial(Homo sapiens (Human))
Afraxis
Curated by ChEMBL
LigandPNGBDBM50363258(CHEMBL1944712)
Affinity DataIC50: >3.00E+4nM. Assay description: Inhibition of human eNOS expressed in HEK293 cells assessed as NO production by 2,3-diaminonapthalene-based fluorescence assay
In DepthDetails ArticlePubMed
TargetNitric oxide synthase, inducible(Homo sapiens (Human))
Afraxis
Curated by ChEMBL
LigandPNGBDBM50363258(CHEMBL1944712)
Affinity DataIC50:  31nM. Assay description: Inhibition of human iNOS expressed in HEK293 cells assessed as NO production by 2,3-diaminonapthalene-based fluorescence assay
In DepthDetails ArticlePubMed
TargetNitric oxide synthase, brain(Homo sapiens (Human))
Afraxis
Curated by ChEMBL
LigandPNGBDBM50363258(CHEMBL1944712)
Affinity DataIC50:  170nM. Assay description: Inhibition of human nNOS expressed in HEK293 cells assessed as NO production by 2,3-diaminonapthalene-based fluorescence assay
In DepthDetails ArticlePubMed