BDBM50363452 CHEMBL1946330
SMILES CCNc1ncc2nc(Nc3ccccc3F)n(C3CCCC3)c2n1
InChI Key InChIKey=YPXNJMUSTWLKRM-UHFFFAOYSA-N
Data  4 IC50
  Tab Delimited (TSV)   2D SDfile   Computed 3D by Vconf -m prep SDfile
Find this compound or compounds like it in BindingDB:
Activity Spreadsheet -- Enzyme Inhibition Constant Data from BindingDB
Found 4 hits for monomerid = 50363452
TargetMitogen-activated protein kinase 8(Homo sapiens (Human))
Celgene
Curated by ChEMBL
LigandPNGBDBM50363452(CHEMBL1946330)
Affinity DataIC50:  1.80E+3nM. Assay description: Inhibition of full length Hexa-His-tagged JNK1 using GST-tagged cJun and [gamma33P]ATP as substrate after 60 mins by scintillation counting
In DepthDetails ArticlePubMed
TargetMitogen-activated protein kinase 14(Homo sapiens (Human))
Celgene
Curated by ChEMBL
LigandPNGBDBM50363452(CHEMBL1946330)
Affinity DataIC50:  2.60E+3nM. Assay description: Inhibition of p38alpha using MBP and [gamma33P]ATP as substrate after 60 mins by scintillation counting
In DepthDetails ArticlePubMed
TargetMitogen-activated protein kinase 10(Homo sapiens (Human))
Celgene
Curated by ChEMBL
LigandPNGBDBM50363452(CHEMBL1946330)
Affinity DataIC50:  260nM. Assay description: Inhibition of full length Hexa-His-tagged JNK3 using GST-tagged cJun and [gamma33P]ATP as substrate after 60 mins by scintillation counting
In DepthDetails ArticlePubMed
TargetMitogen-activated protein kinase 9(Homo sapiens (Human))
Celgene
Curated by ChEMBL
LigandPNGBDBM50363452(CHEMBL1946330)
Affinity DataIC50:  140nM. Assay description: Inhibition of full length Hexa-His-tagged JNK2 using GST-tagged cJun and [gamma33P]ATP as substrate after 60 mins by scintillation counting
In DepthDetails ArticlePubMed