BDBM50363639 CHEMBL1946205
SMILES [O-][N+](=O)c1ccc(cc1)C(=O)Cn1cccc1
InChI Key InChIKey=ILLXDTISBBMYGM-UHFFFAOYSA-N
Data  1 KI
  Tab Delimited (TSV)   2D SDfile   Computed 3D by Vconf -m prep SDfile
Find this compound or compounds like it in BindingDB:
Activity Spreadsheet -- Enzyme Inhibition Constant Data from BindingDB
Found 1 hit for monomerid = 50363639
TargetNitric oxide synthase, brain(Rattus norvegicus (rat))
Universit£
Curated by ChEMBL
LigandPNGBDBM50363639(CHEMBL1946205)
Affinity DataKi:  2.30E+5nM. Assay description: Inhibition of rat recombinant nNOS expressed in baculovirus-infected Sf9 cells assessed as conversion of oxyhemoglobin to methemoglobin by UV spectro...
In DepthDetails ArticlePubMed