BDBM50363717 CHEMBL1944957
SMILES CN(C)c1ccc(\C=C\c2sc3cc(ccc3[n+]2C)[N+]([O-])=O)cc1
InChI Key InChIKey=WSEDACAYGBLZGD-UHFFFAOYSA-N
Data  1 IC50
  Tab Delimited (TSV)   2D SDfile   Computed 3D by Vconf -m prep SDfile
Find this compound or compounds like it in BindingDB:
Activity Spreadsheet -- Enzyme Inhibition Constant Data from BindingDB
Found 1 hit for monomerid = 50363717
TargetInsulin receptor(Homo sapiens (Human))
The Ohio State University College Of Medicine
Curated by ChEMBL
LigandPNGBDBM50363717(CHEMBL1944957)
Affinity DataIC50:  12nM. Assay description: Displacement of thioflavin T from insulin receptor by thioflavin-T fluorescent dye assay
In DepthDetails ArticlePubMed