BDBM50363831 CHEMBL1945008
SMILES CCCc1nc2c(C)cc(cc2n1Cc1ccc(cc1)-c1ccccc1C(O)=O)C(=O)NCCc1ccc(OC)cc1
InChI Key InChIKey=RIZLSQIVYHEYRR-UHFFFAOYSA-N
Data  2 IC50
  Tab Delimited (TSV)   2D SDfile   Computed 3D by Vconf -m prep SDfile
Find this compound or compounds like it in BindingDB:
Activity Spreadsheet -- Enzyme Inhibition Constant Data from BindingDB
Found 2 hits for monomerid = 50363831
TargetType-2 angiotensin II receptor(Homo sapiens (Human))
Beijing Institute Of Technology
Curated by ChEMBL
LigandPNGBDBM50363831(CHEMBL1945008)
Affinity DataIC50:  1.50E+3nM. Assay description: Displacement of [125I]Sar1 Ile8-Ang 2 from angiotensin 2 AT2 receptor after 180 mins by gamma counting
In DepthDetails ArticlePubMed
TargetType-1 angiotensin II receptor(Homo sapiens (Human))
Beijing Institute Of Technology
Curated by ChEMBL
LigandPNGBDBM50363831(CHEMBL1945008)
Affinity DataIC50:  214nM. Assay description: Displacement of [125I]Sar1 Ile8-Ang 2 from angiotensin 2 AT1 receptor after 180 mins by gamma counting
In DepthDetails ArticlePubMed