BDBM50363853 CHEMBL1946244
SMILES CCOP(=O)(OCC)[C@H](Nc1ccc(Br)cc1)c1ccccc1O
InChI Key InChIKey=IGLFQKPVXIZQFX-KRWDZBQOSA-N
Data  5 IC50
  Tab Delimited (TSV)   2D SDfile   Computed 3D by Vconf -m prep SDfile
Find this compound or compounds like it in BindingDB:
Activity Spreadsheet -- Enzyme Inhibition Constant Data from BindingDB
Found 5 hits for monomerid = 50363853
TargetTyrosine-protein phosphatase non-receptor type 1(Homo sapiens (Human))
Shanxi University
Curated by ChEMBL
LigandPNGBDBM50363853(CHEMBL1946244)
Affinity DataIC50:  9.17E+4nM. Assay description: Inhibition of human PTP1B using p-nitrophenol phosphate as substrate incubated for 35 mins prior to substrate addition measured after 30 mins by spec...
In DepthDetails ArticlePubMed
TargetTyrosine-protein phosphatase non-receptor type 2(Homo sapiens (Human))
Shanxi University
Curated by ChEMBL
LigandPNGBDBM50363853(CHEMBL1946244)
Affinity DataIC50:  5.11E+4nM. Assay description: Inhibition of human TCPTP using p-nitrophenol phosphate as substrate incubated for 35 mins prior to substrate addition measured after 30 mins by spec...
In DepthDetails ArticlePubMed
TargetTyrosine-protein phosphatase non-receptor type 11(Homo sapiens (Human))
Shanxi University
Curated by ChEMBL
LigandPNGBDBM50363853(CHEMBL1946244)
Affinity DataIC50: >1.00E+7nM. Assay description: Inhibition of human SHP2 using p-nitrophenol phosphate as substrate incubated for 35 mins prior to substrate addition measured after 30 mins by spect...
In DepthDetails ArticlePubMed
TargetTyrosine-protein phosphatase non-receptor type 6(Homo sapiens (Human))
Shanxi University
Curated by ChEMBL
LigandPNGBDBM50363853(CHEMBL1946244)
Affinity DataIC50: >1.00E+7nM. Assay description: Inhibition of human SHP1 using p-nitrophenol phosphate as substrate incubated for 35 mins prior to substrate addition measured after 30 mins by spect...
In DepthDetails ArticlePubMed
TargetTyrosine-protein phosphatase non-receptor type 9(Homo sapiens (Human))
Shanxi University
Curated by ChEMBL
LigandPNGBDBM50363853(CHEMBL1946244)
Affinity DataIC50:  1.73E+5nM. Assay description: Inhibition of human PTP-MEG2 using p-nitrophenol phosphate as substrate incubated for 35 mins prior to substrate addition measured after 30 mins by s...
In DepthDetails ArticlePubMed