BDBM50363856 CHEMBL1946247
SMILES Oc1ccc(N[C@H](c2ccccc2O)P(O)(O)=O)cc1
InChI Key InChIKey=BMAOKLRHVXDYHM-ZDUSSCGKSA-N
Data  5 IC50
  Tab Delimited (TSV)   2D SDfile   Computed 3D by Vconf -m prep SDfile
Find this compound or compounds like it in BindingDB:
Activity Spreadsheet -- Enzyme Inhibition Constant Data from BindingDB
Found 5 hits for monomerid = 50363856
TargetTyrosine-protein phosphatase non-receptor type 1(Homo sapiens (Human))
Shanxi University
Curated by ChEMBL
LigandPNGBDBM50363856(CHEMBL1946247)
Affinity DataIC50:  6.64E+3nM. Assay description: Inhibition of human PTP1B using p-nitrophenol phosphate as substrate incubated for 35 mins prior to substrate addition measured after 30 mins by spec...
In DepthDetails ArticlePubMed
TargetTyrosine-protein phosphatase non-receptor type 2(Homo sapiens (Human))
Shanxi University
Curated by ChEMBL
LigandPNGBDBM50363856(CHEMBL1946247)
Affinity DataIC50:  1.44E+4nM. Assay description: Inhibition of human TCPTP using p-nitrophenol phosphate as substrate incubated for 35 mins prior to substrate addition measured after 30 mins by spec...
In DepthDetails ArticlePubMed
TargetTyrosine-protein phosphatase non-receptor type 11(Homo sapiens (Human))
Shanxi University
Curated by ChEMBL
LigandPNGBDBM50363856(CHEMBL1946247)
Affinity DataIC50: >1.00E+7nM. Assay description: Inhibition of human SHP2 using p-nitrophenol phosphate as substrate incubated for 35 mins prior to substrate addition measured after 30 mins by spect...
In DepthDetails ArticlePubMed
TargetTyrosine-protein phosphatase non-receptor type 6(Homo sapiens (Human))
Shanxi University
Curated by ChEMBL
LigandPNGBDBM50363856(CHEMBL1946247)
Affinity DataIC50: >1.00E+7nM. Assay description: Inhibition of human SHP1 using p-nitrophenol phosphate as substrate incubated for 35 mins prior to substrate addition measured after 30 mins by spect...
In DepthDetails ArticlePubMed
TargetTyrosine-protein phosphatase non-receptor type 9(Homo sapiens (Human))
Shanxi University
Curated by ChEMBL
LigandPNGBDBM50363856(CHEMBL1946247)
Affinity DataIC50:  1.60E+5nM. Assay description: Inhibition of human PTP-MEG2 using p-nitrophenol phosphate as substrate incubated for 35 mins prior to substrate addition measured after 30 mins by s...
In DepthDetails ArticlePubMed