BDBM50363898 CHEMBL1946255
SMILES Clc1ccc(cc1)N1CCCN(CCCc2nc3ccccc3s2)CC1
InChI Key InChIKey=OUSOPIMSKOMYQI-UHFFFAOYSA-N
Data  10 KI
  Tab Delimited (TSV)   2D SDfile   Computed 3D by Vconf -m prep SDfile
Find this compound or compounds like it in BindingDB:
Activity Spreadsheet -- Enzyme Inhibition Constant Data from BindingDB
Found 10 hits for monomerid = 50363898
TargetSodium-dependent serotonin transporter(Homo sapiens (Human))
Florida A&M University
Curated by ChEMBL
LigandPNGBDBM50363898(CHEMBL1946255)
Affinity DataKi:  34nM. Assay description: Displacement of [3H]Citalopram from human SERT by liquid scintillation counting
In DepthDetails ArticlePubMed
Target5-hydroxytryptamine receptor 1A(Homo sapiens (Human))
Florida A&M University
Curated by ChEMBL
LigandPNGBDBM50363898(CHEMBL1946255)
Affinity DataKi:  216nM. Assay description: Displacement of [3H]8-OH-DPAT from human 5HT1A receptor by liquid scintillation counting
In DepthDetails ArticlePubMed
Target5-hydroxytryptamine receptor 1A(Homo sapiens (Human))
Florida A&M University
Curated by ChEMBL
LigandPNGBDBM50363898(CHEMBL1946255)
Affinity DataKi:  216nM. Assay description: Displacement of [3H]8-OH-DPAT from 5-HT1A receptor expressed in CHO cells after 20 mins by liquid scintillation counting
In DepthDetails ArticlePubMed
TargetD(4) dopamine receptor(RAT)
Florida A&M University
Curated by ChEMBL
LigandPNGBDBM50363898(CHEMBL1946255)
Affinity DataKi:  431nM. Assay description: Displacement of [3H]-N-methylspiperone from rat dopamine D4 receptor
In DepthDetails ArticlePubMed
TargetD(4) dopamine receptor(RAT)
Florida A&M University
Curated by ChEMBL
LigandPNGBDBM50363898(CHEMBL1946255)
Affinity DataKi:  431nM. Assay description: Displacement of [3H]N-methylspiperone from rat dopamine D4 receptor by liquid scintillation counting
In DepthDetails ArticlePubMed
TargetHistamine H1 receptor(Homo sapiens (Human))
Florida A&M University
Curated by ChEMBL
LigandPNGBDBM50363898(CHEMBL1946255)
Affinity DataKi:  665nM. Assay description: Displacement of [3H]-Pyrilamine from human histamine H1 receptor by liquid scintillation counter
In DepthDetails ArticlePubMed
Target5-hydroxytryptamine receptor 2A(Homo sapiens (Human))
Florida A&M University
Curated by ChEMBL
LigandPNGBDBM50363898(CHEMBL1946255)
Affinity DataKi:  696nM. Assay description: Binding affinity at 5-HT2A receptor by radioligand displacement assay
In DepthDetails ArticlePubMed
Target5-hydroxytryptamine receptor 2A(Homo sapiens (Human))
Florida A&M University
Curated by ChEMBL
LigandPNGBDBM50363898(CHEMBL1946255)
Affinity DataKi:  696nM. Assay description: Displacement of [3H]Ketanserin from human 5HT2A receptor by liquid scintillation counting
In DepthDetails ArticlePubMed
TargetD(3) dopamine receptor(Homo sapiens (Human))
Florida A&M University
Curated by ChEMBL
LigandPNGBDBM50363898(CHEMBL1946255)
Affinity DataKi:  863nM. Assay description: Displacement of [3H]-N-methylspiperone from dopamine D3 receptor expressed in human MES-23.5
In DepthDetails ArticlePubMed
Target5-hydroxytryptamine receptor 7(Homo sapiens (Human))
Florida A&M University
Curated by ChEMBL
LigandPNGBDBM50363898(CHEMBL1946255)
Affinity DataKi:  2.06E+3nM. Assay description: Displacement of [3H]LSD from human 5HT7 receptor by liquid scintillation counting
In DepthDetails ArticlePubMed