BDBM50364065 CHEMBL1950676
SMILES [BH3-]P(=O)(OC[C@H]1O[C@H]([C@H](O)[C@@H]1O)n1ccc(=O)[nH]c1=O)OP([O-])(=O)OP([O-])(=O)OC[C@H]1O[C@H]([C@H](O)[C@@H]1O)n1ccc(=O)[nH]c1=O
InChI Key InChIKey=VZBKWDUQFDJOAN-YBIYRXCYSA-L
Data  3 EC50
  Tab Delimited (TSV)   2D SDfile   Computed 3D by Vconf -m prep SDfile
Find this compound or compounds like it in BindingDB:
Activity Spreadsheet -- Enzyme Inhibition Constant Data from BindingDB
Found 3 hits for monomerid = 50364065
TargetP2Y purinoceptor 6(Rattus norvegicus)
Bar-Ilan University
Curated by ChEMBL
LigandPNGBDBM50364065(CHEMBL1950676)
Affinity DataEC50:  720nM. Assay description: Agonist activity at rat P2Y purinoceptor 6 expressed in human 1321N1 cells assessed as increase in intracellular calcium concentration by spectrofluo...
In DepthDetails ArticlePubMed
TargetP2Y purinoceptor 1(Meleagris gallopavo)
Bar-Ilan University
Curated by ChEMBL
LigandPNGBDBM50364065(CHEMBL1950676)
Affinity DataEC50:  4.40E+3nM. Assay description: Agonist activity at turkey P2Y purinoceptor 1 expressed in human 1321N1 cells assessed as increase in intracellular calcium concentration by spectrof...
In DepthDetails ArticlePubMed
TargetP2Y purinoceptor 6(Rattus norvegicus)
Bar-Ilan University
Curated by ChEMBL
LigandPNGBDBM50364065(CHEMBL1950676)
Affinity DataEC50:  720nM. Assay description: Agonist activity at rat P2Y purinoceptor 6 expressed in human 1321N1 cells assessed as increase in intracellular calcium concentration by spectrofluo...
In DepthDetails ArticlePubMed