BDBM50364196 CHEMBL1951632
SMILES CNC(=O)N1CC[C@@H]([C@H](C1)c1ccc(F)cc1C)C(=O)N(C)Cc1cc(cc(c1)C(F)(F)F)C(F)(F)F
InChI Key InChIKey=WYRVPBJYGNHDQS-LEWJYISDSA-N
Data  1 IC50
  Tab Delimited (TSV)   2D SDfile   Computed 3D by Vconf -m prep SDfile
Find this compound or compounds like it in BindingDB:
Activity Spreadsheet -- Enzyme Inhibition Constant Data from BindingDB
Found 1 hit for monomerid = 50364196
TargetSubstance-P receptor(Homo sapiens (Human))
Takeda Pharmaceutical
Curated by ChEMBL
LigandPNGBDBM50364196(CHEMBL1951632)
Affinity DataIC50:  0.0480nM. Assay description: Displacement of [125I]BH-SP from tachykinin NK1 receptor in human IM9 cells after 30 mins by scintillation counting
In DepthDetails ArticlePubMed