BDBM50364303 CHEMBL1952315
SMILES OCCN(CCO)c1ccc(NC(=O)c2cnc3cc(Cl)cc(Cl)c3c2O)cc1
InChI Key InChIKey=SKZQIZSEIJUFOR-UHFFFAOYSA-N
Data  1 IC50
  Tab Delimited (TSV)   2D SDfile   Computed 3D by Vconf -m prep SDfile
Find this compound or compounds like it in BindingDB:
Activity Spreadsheet -- Enzyme Inhibition Constant Data from BindingDB
Found 1 hit for monomerid = 50364303
TargetBeta-secretase 1(Homo sapiens (Human))
Beijing Institute Of Pharmacology And Toxicology
Curated by ChEMBL
LigandPNGBDBM50364303(CHEMBL1952315)
Affinity DataIC50:  2.27E+3nM. Assay description: Inhibition of recombinant human BACE1 using Eu-CEVNLDAEFK-Qsy7 as substrate by HTRF assay
In DepthDetails ArticlePubMed