BDBM50364384 CHEMBL1950295
SMILES O[C@H]1CC[C@@H](CC1)Nc1ncc2nc(Nc3ccc(F)cc3F)n(C3CCOCC3)c2n1
InChI Key InChIKey=SEENQGCHZHJXQG-KOMQPUFPSA-N
Data  2 IC50
  Tab Delimited (TSV)   2D SDfile   Computed 3D by Vconf -m prep SDfile
Find this compound or compounds like it in BindingDB:
Activity Spreadsheet -- Enzyme Inhibition Constant Data from BindingDB
Found 2 hits for monomerid = 50364384
TargetMitogen-activated protein kinase 14(Homo sapiens (Human))
Celgene
Curated by ChEMBL
LigandPNGBDBM50364384(CHEMBL1950295)
Affinity DataIC50:  2.70E+3nM. Assay description: Inhibition of p38alpha using myelin basic protein as substrate preincubated for 15 mins prior ATP addition measured after 60 mins by scintillation co...
In DepthDetails ArticlePubMed
TargetMitogen-activated protein kinase 8(Homo sapiens (Human))
Celgene
Curated by ChEMBL
LigandPNGBDBM50364384(CHEMBL1950295)
Affinity DataIC50:  390nM. Assay description: Inhibition of hexa-His-tagged JNK1 expressed in baculoviral system using GST-tagged c-Jun as substrate preincubated for 15 mins prior ATP addition me...
In DepthDetails ArticlePubMed