BDBM50364457 CHEMBL1950684
SMILES COc1ccc(cc1)C(=O)Nc1ccc(cc1)-c1nc2n(C)c(=O)n(C)c(=O)c2n1C
InChI Key InChIKey=FRBZSQSMEQIVFW-UHFFFAOYSA-N
Data  1 KI  1 IC50
  Tab Delimited (TSV)   2D SDfile   Computed 3D by Vconf -m prep SDfile
Find this compound or compounds like it in BindingDB:
Activity Spreadsheet -- Enzyme Inhibition Constant Data from BindingDB
Found 2 hits for monomerid = 50364457
TargetAmine oxidase [flavin-containing] B(Mus musculus)
Wenzhou Medical College
Curated by ChEMBL
LigandPNGBDBM50364457(CHEMBL1950684)
Affinity DataKi:  1.18E+3nM. Assay description: Inhibition of MAO-B in mouse cerebral homogenate using kynuramine as substrate after 30 mins by fluorimetry in the presence of MOA-A inhibitor clorgy...
In DepthDetails ArticlePubMed
TargetAmine oxidase [flavin-containing] B(Mus musculus)
Wenzhou Medical College
Curated by ChEMBL
LigandPNGBDBM50364457(CHEMBL1950684)
Affinity DataIC50:  1.07E+4nM. Assay description: Inhibition of MAO-B in mouse cerebral homogenate using kynuramine as substrate after 30 mins by fluorimetry in the presence of MOA-A inhibitor clorgy...
In DepthDetails ArticlePubMed