BDBM50364502 CHEMBL1950848
SMILES CN[C@@H](C)C(=O)N[C@@H](C1CCCCC1)C(=O)N[C@H]1CCCN(CCc2ccccc2F)C1
InChI Key InChIKey=DWCMJOABGJQOPI-HARLFGEKSA-N
Data  1 IC50  1 EC50
  Tab Delimited (TSV)   2D SDfile   Computed 3D by Vconf -m prep SDfile
Find this compound or compounds like it in BindingDB:
Activity Spreadsheet -- Enzyme Inhibition Constant Data from BindingDB
Found 2 hits for monomerid = 50364502
TargetBaculoviral IAP repeat-containing protein 2(Homo sapiens (Human))
Astrazeneca R&D Boston
Curated by ChEMBL
LigandPNGBDBM50364502(CHEMBL1950848)
Affinity DataIC50:  33nM. Assay description: Antagonist activity at GST-tagged BIR3 domain of cIAP1 using AbuRPFK-5FAM after 20 mins by fluorescence polarization assay
In DepthDetails ArticlePubMed
TargetBaculoviral IAP repeat-containing protein 2(Homo sapiens (Human))
Astrazeneca R&D Boston
Curated by ChEMBL
LigandPNGBDBM50364502(CHEMBL1950848)
Affinity DataEC50:  104nM. Assay description: Antagonist activity at cIAP1 in human MDA-MB-231 cells assessed as cIAP1 degradation after 1 hr by ELISA
In DepthDetails ArticlePubMed