BDBM50364537 CHEMBL1951023
SMILES CC(C)OC(=O)N1CCC(CC1)Oc1ncnc(Nc2ccc(nc2)S(C)(=O)=O)c1C
InChI Key InChIKey=WDWMROZWFVKIOA-UHFFFAOYSA-N
Data  2 EC50
  Tab Delimited (TSV)   2D SDfile   Computed 3D by Vconf -m prep SDfile
Find this compound or compounds like it in BindingDB:
Activity Spreadsheet -- Enzyme Inhibition Constant Data from BindingDB
Found 2 hits for monomerid = 50364537
TargetGlucose-dependent insulinotropic receptor(Rattus norvegicus)
Arena Pharmaceuticals
Curated by ChEMBL
LigandPNGBDBM50364537(CHEMBL1951023)
Affinity DataEC50: >5.00E+3nM. Assay description: Agonist activity at rat GPR119 receptor assessed as cAMP production by HTRF assay
In DepthDetails ArticlePubMed
TargetGlucose-dependent insulinotropic receptor(Homo sapiens (Human))
Arena Pharmaceuticals
Curated by ChEMBL
LigandPNGBDBM50364537(CHEMBL1951023)
Affinity DataEC50:  1.00E+3nM. Assay description: Agonist activity at human GPR119 receptor assessed as cAMP production by HTRF assay
In DepthDetails ArticlePubMed