BDBM50364785 CHEMBL1952106
SMILES FC(F)(F)Oc1cccc(c1)-n1nnc2ccc(NCCc3cccnc3)nc12
InChI Key InChIKey=IDGDWFBVXGQVKE-UHFFFAOYSA-N
Data  1 IC50
  Tab Delimited (TSV)   2D SDfile   Computed 3D by Vconf -m prep SDfile
Find this compound or compounds like it in BindingDB:
Activity Spreadsheet -- Enzyme Inhibition Constant Data from BindingDB
Found 1 hit for monomerid = 50364785
TargetSerine/threonine-protein kinase pim-1(Homo sapiens (Human))
Spanish National Cancer Research Centre (Cnio)
Curated by ChEMBL
LigandPNGBDBM50364785(CHEMBL1952106)
Affinity DataIC50:  433nM. Assay description: Inhibition of PIM1
In DepthDetails ArticlePubMed