BDBM50364815 CHEMBL1952115
SMILES CC(C)N1CCC(CNc2ccc3nnn(-c4cccc(OC(F)(F)F)c4)c3n2)CC1
InChI Key InChIKey=VOTBGEUXDNPCHH-UHFFFAOYSA-N
Data  1 IC50
  Tab Delimited (TSV)   2D SDfile   Computed 3D by Vconf -m prep SDfile
Find this compound or compounds like it in BindingDB:
Activity Spreadsheet -- Enzyme Inhibition Constant Data from BindingDB
Found 1 hit for monomerid = 50364815
TargetSerine/threonine-protein kinase pim-1(Homo sapiens (Human))
Spanish National Cancer Research Centre (Cnio)
Curated by ChEMBL
LigandPNGBDBM50364815(CHEMBL1952115)
Affinity DataIC50:  77nM. Assay description: Inhibition of PIM1
In DepthDetails ArticlePubMed