BDBM50364821 CHEMBL1952122
SMILES CNC1CCN(CC1)c1ccc2nnn(-c3cccc(OC(F)(F)F)c3)c2n1
InChI Key InChIKey=KTUUDVJCWHWFFT-UHFFFAOYSA-N
Data  1 IC50
  Tab Delimited (TSV)   2D SDfile   Computed 3D by Vconf -m prep SDfile
Find this compound or compounds like it in BindingDB:
Activity Spreadsheet -- Enzyme Inhibition Constant Data from BindingDB
Found 1 hit for monomerid = 50364821
TargetSerine/threonine-protein kinase pim-1(Homo sapiens (Human))
Spanish National Cancer Research Centre (Cnio)
Curated by ChEMBL
LigandPNGBDBM50364821(CHEMBL1952122)
Affinity DataIC50:  87nM. Assay description: Inhibition of PIM1
In DepthDetails ArticlePubMed