BDBM50364858 CHEMBL1950139
SMILES CN(C)CCOc1ccc2-c3ccc(OCCN(C)C)cc3C(=O)c2c1
InChI Key InChIKey=WVGDOXLWDJMWGP-UHFFFAOYSA-N
Data  1 KI
  Tab Delimited (TSV)   2D SDfile   Computed 3D by Vconf -m prep SDfile
Find this compound or compounds like it in BindingDB:
Activity Spreadsheet -- Enzyme Inhibition Constant Data from BindingDB
Found 1 hit for monomerid = 50364858
TargetNeuronal acetylcholine receptor subunit alpha-7(Rattus norvegicus (Rat))
Abbott Laboratories
Curated by ChEMBL
LigandPNGBDBM50364858(CHEMBL1950139)
Affinity DataKi:  50nM. Assay description: Displacement of [3H]methyllylcaconitine from alpha7 nAChR in rat brain
In DepthDetails ArticlePubMed