BDBM50364862 CHEMBL1950143
SMILES CN1CCC[C@H]1COc1ccc2-c3ccc(OC[C@@H]4CCCN4C)cc3C(=O)c2c1
InChI Key InChIKey=MPSVSIQCCLCJPT-ROUUACIJSA-N
Data  1 KI
  Tab Delimited (TSV)   2D SDfile   Computed 3D by Vconf -m prep SDfile
Find this compound or compounds like it in BindingDB:
Activity Spreadsheet -- Enzyme Inhibition Constant Data from BindingDB
Found 1 hit for monomerid = 50364862
TargetNeuronal acetylcholine receptor subunit alpha-7(Rattus norvegicus (Rat))
Abbott Laboratories
Curated by ChEMBL
LigandPNGBDBM50364862(CHEMBL1950143)
Affinity DataKi:  12nM. Assay description: Displacement of [3H]methyllylcaconitine from alpha7 nAChR in rat brain
In DepthDetails ArticlePubMed