BDBM50364943 CHEMBL1950486
SMILES CC1CCN(CC1)C(=O)c1ccc2n(c3CCN(Cc3c2c1)C1CCOCC1)S(=O)(=O)n1ccnc1
InChI Key InChIKey=KQPJRFXWAWUUTE-UHFFFAOYSA-N
Data  1 KI
  Tab Delimited (TSV)   2D SDfile   Computed 3D by Vconf -m prep SDfile
Find this compound or compounds like it in BindingDB:
Activity Spreadsheet -- Enzyme Inhibition Constant Data from BindingDB
Found 1 hit for monomerid = 50364943
TargetCannabinoid receptor 1(Homo sapiens (Human))
Astrazeneca R&D Montreal
Curated by ChEMBL
LigandPNGBDBM50364943(CHEMBL1950486)
Affinity DataKi:  592nM. Assay description: Displacement of [3H]-CP55,940 from human CB1 receptor expressed in HEK293 cells
In DepthDetails ArticlePubMed