BDBM50365069 CHEMBL1951080
SMILES COc1cc(OC)c(cc1NC(=O)CSCC(O)=O)S(=O)(=O)N1C(C)CCc2ccccc12
InChI Key InChIKey=JCIHGZJEMNHEET-UHFFFAOYSA-N
Data  1 IC50
  Tab Delimited (TSV)   2D SDfile   Computed 3D by Vconf -m prep SDfile
Find this compound or compounds like it in BindingDB:
Activity Spreadsheet -- Enzyme Inhibition Constant Data from BindingDB
Found 1 hit for monomerid = 50365069
TargetBifunctional protein GlmU(Streptococcus pneumoniae)
Astrazeneca R&D Boston
Curated by ChEMBL
LigandPNGBDBM50365069(CHEMBL1951080)
Affinity DataIC50: >2.00E+5nM. Assay description: Inhibition of Streptococcus pneumoniae acetyltransferase activity of GlmU using acetyl-CoA and glucosamine-1-phosphate after 30 mins by Ellman's meth...
In DepthDetails ArticlePubMed