BDBM50365077 CHEMBL1951166
SMILES CCN(c1ccccc1C)S(=O)(=O)c1cc(NC(C)=O)c(OC)cc1OC
InChI Key InChIKey=IRVGIJWUGUOMCY-UHFFFAOYSA-N
Data  3 IC50
  Tab Delimited (TSV)   2D SDfile   Computed 3D by Vconf -m prep SDfile
Find this compound or compounds like it in BindingDB:
Activity Spreadsheet -- Enzyme Inhibition Constant Data from BindingDB
Found 3 hits for monomerid = 50365077
TargetBifunctional protein GlmU(Escherichia coli)
Csir-Indian Institute Of Integrative Medicine
Curated by ChEMBL
LigandPNGBDBM50365077(CHEMBL1951166)
Affinity DataIC50:  1.50E+4nM. Assay description: Inhibition of Escherichia coli GlmU acetyltransferase activity assessed as coenzyme A production using acetyl CoA substrate
In DepthDetails ArticlePubMed
TargetBifunctional protein GlmU(Streptococcus pneumoniae)
Astrazeneca R&D Boston
Curated by ChEMBL
LigandPNGBDBM50365077(CHEMBL1951166)
Affinity DataIC50: >2.00E+5nM. Assay description: Inhibition of Streptococcus pneumoniae acetyltransferase activity of GlmU using acetyl-CoA and glucosamine-1-phosphate after 30 mins by Ellman's meth...
In DepthDetails ArticlePubMed
TargetBifunctional protein GlmU(Escherichia coli)
Csir-Indian Institute Of Integrative Medicine
Curated by ChEMBL
LigandPNGBDBM50365077(CHEMBL1951166)
Affinity DataIC50:  1.50E+4nM. Assay description: Inhibition of Escherichia coli GlmU acetyltransferase activity assessed as coenzyme A production using acetyl CoA substrate
In DepthDetails ArticlePubMed