BDBM50365100 CHEMBL1951195
SMILES C[n+]1cn([C@@H]2O[C@H](COP([O-])(=O)OP([O-])(=O)OP([O-])(=O)NP([O-])(=O)OC[C@H]3O[C@H]([C@H](O)[C@@H]3O)n3cnc4c3nc(N)[nH]c4=O)[C@@H](O)[C@H]2O)c2nc(N)[n-]c(=O)c12
InChI Key InChIKey=OTDSBYOQHAECNA-INFSMZHSSA-J
Data  2 IC50
  Tab Delimited (TSV)   2D SDfile   Computed 3D by Vconf -m prep SDfile
Find this compound or compounds like it in BindingDB:
Activity Spreadsheet -- Enzyme Inhibition Constant Data from BindingDB
Found 2 hits for monomerid = 50365100
TargetEukaryotic translation initiation factor 4E(Oryctolagus cuniculus)
University Of Warsaw
Curated by ChEMBL
LigandPNGBDBM50365100(CHEMBL1951195)
Affinity DataIC50:  3.52E+3nM. Assay description: Inhibition of eIF4E-mediated mRNA translation in rabbit reticulocyte lysate by luciferase reporter gene assay
In DepthDetails ArticlePubMed
TargetEukaryotic translation initiation factor 4E(Oryctolagus cuniculus)
University Of Warsaw
Curated by ChEMBL
LigandPNGBDBM50365100(CHEMBL1951195)
Affinity DataIC50:  1.60E+4nM. Assay description: Inhibition of eIF4E-mediated mRNA translation in rabbit reticulocyte lysate pre-incubated for 60 mins prior to mRNA addition by luciferase reporter g...
In DepthDetails ArticlePubMed