BDBM50365194 CHEMBL1950372
SMILES COc1ccc(\C=C\C(=O)c2ccc(NC(C)=O)c(c2)-c2ccc(F)cc2)cc1OC
InChI Key InChIKey=CQVGIXMAEVEDRL-UUILKARUSA-N
Data  1 IC50
  Tab Delimited (TSV)   2D SDfile   Computed 3D by Vconf -m prep SDfile
Find this compound or compounds like it in BindingDB:
Activity Spreadsheet -- Enzyme Inhibition Constant Data from BindingDB
Found 1 hit for monomerid = 50365194
TargetTranscription factor p65(Homo sapiens (Human))
Sun Yat-Sen University
Curated by ChEMBL
LigandPNGBDBM50365194(CHEMBL1950372)
Affinity DataIC50:  2.65E+3nM. Assay description: Inhibition of TNF-alpha-induced NF-kappaB p65 nuclear translocation in human A549 cells after 2 hrs by fluorescence assay
In DepthDetails ArticlePubMed