BDBM50365233 CHEMBL1956279::US9238653, Table 5, Compound 53
SMILES Cc1cc(Nc2ccc(cc2)S(F)(F)(F)(F)F)n2nc(nc2n1)C1CC1
InChI Key InChIKey=JFTBSVDVJGSVIE-UHFFFAOYSA-N
Data  2 IC50
  Tab Delimited (TSV)   2D SDfile   Computed 3D by Vconf -m prep SDfile
Find this compound or compounds like it in BindingDB:
Activity Spreadsheet -- Enzyme Inhibition Constant Data from BindingDB
Found 2 hits for monomerid = 50365233
TargetDihydroorotate dehydrogenase (quinone), mitochondrial(Homo sapiens (Human))
Glaxosmithkline
Curated by ChEMBL
LigandPNGBDBM50365233(CHEMBL1956279 | US9238653, Table 5, Compound 53)
Affinity DataIC50: >1.00E+5nM. Assay description: Inhibition of human C-terminal hexa-His tagged DHODH expressed in Escherichia coli by DCIP reduction assay
In DepthDetails ArticlePubMed
TargetDihydroorotate dehydrogenase (quinone), mitochondrial(Plasmodium falciparum (isolate 3D7))
Board Of Regents, The University Of Texas System
US Patent
LigandPNGBDBM50365233(CHEMBL1956279 | US9238653, Table 5, Compound 53)
Affinity DataIC50:  93nMpH: 8.0Assay Description:For studying inhibition of Plasmodium or human DHODH enzyme, two assays that are in routine use are described, for example, in Baldwin, et al. (2002)...
In DepthDetails US Patent