BDBM50365696 CHEMBL1958409
SMILES O=c1cc(NC2CCCCC2)cc([nH]1)-c1c[nH]c2ncccc12
InChI Key InChIKey=CNWANCPVTDLVLN-UHFFFAOYSA-N
Data  1 KI
  Tab Delimited (TSV)   2D SDfile   Computed 3D by Vconf -m prep SDfile
Find this compound or compounds like it in BindingDB:
Activity Spreadsheet -- Enzyme Inhibition Constant Data from BindingDB
Found 1 hit for monomerid = 50365696
TargetCell division cycle 7-related protein kinase/Protein DBF4 homolog A(Homo sapiens (Human))
Abbott Laboratories
Curated by ChEMBL
LigandPNGBDBM50365696(CHEMBL1958409)
Affinity DataKi:  1.10nM. Assay description: Inhibition of human CDC7/DBF4 expressed using baculovirus expression system assessed as [33P]gamma-ATP incorporation into substrate after 60 mins by ...
In DepthDetails ArticlePubMed