BDBM50365844 CHEMBL1957106
SMILES CC[C@H](NC)C(=O)N[C@H]1[C@@H](CCNCc2ccc(cc2)C(=O)OC)CC[C@H]2CC[C@H](N2C1=O)C(=O)NC(c1ccccc1)c1ccccc1
InChI Key InChIKey=RTINGDYJFFRKGJ-ZUYLYXQESA-N
Data  2 IC50
  Tab Delimited (TSV)   2D SDfile   Computed 3D by Vconf -m prep SDfile
Find this compound or compounds like it in BindingDB:
Activity Spreadsheet -- Enzyme Inhibition Constant Data from BindingDB
Found 2 hits for monomerid = 50365844
TargetE3 ubiquitin-protein ligase XIAP(Homo sapiens (Human))
Cisi
Curated by ChEMBL
LigandPNGBDBM50365844(CHEMBL1957106)
Affinity DataIC50:  57nM. Assay description: Displacement of AbuRPF-K(5-Fam)-NH2 from recombinant human His-tagged-XIAP BIR3 domain after 3 hrs by fluorescence polarization assay
In DepthDetails ArticlePubMed
TargetBaculoviral IAP repeat-containing protein 2(Homo sapiens (Human))
Cisi
Curated by ChEMBL
LigandPNGBDBM50365844(CHEMBL1957106)
Affinity DataIC50: <2nM. Assay description: Displacement of AbuRPF-K(5-Fam)-NH2 from human recombinant His-tagged-cIAP1 BIR3 domain after 3 hrs by fluorescence polarization assay
In DepthDetails ArticlePubMed