BDBM50365980 CHEMBL1956251
SMILES COc1cc2nncc(-c3cnc(N4CCC(CC4)C(C)(C)O)c(c3)C(F)F)c2cc1OC
InChI Key InChIKey=UGTNVOXDGHBRAI-UHFFFAOYSA-N
Data  1 IC50
  Tab Delimited (TSV)   2D SDfile   Computed 3D by Vconf -m prep SDfile
Find this compound or compounds like it in BindingDB:
Activity Spreadsheet -- Enzyme Inhibition Constant Data from BindingDB
Found 1 hit for monomerid = 50365980
LigandPNGBDBM50365980(CHEMBL1956251)
Affinity DataIC50:  1.20nM. Assay description: Inhibition of PDE10A
In DepthDetails ArticlePubMed