BDBM50366157 CHEMBL1955883
SMILES OC[C@H](NC(=O)[C@H](CS)NC(=O)c1ccc(F)cc1)C(O)=O
InChI Key InChIKey=SZCPTIMHIJLVPQ-UWVGGRQHSA-N
Data  2 IC50
  Tab Delimited (TSV)   2D SDfile   Computed 3D by Vconf -m prep SDfile
Find this compound or compounds like it in BindingDB:
Activity Spreadsheet -- Enzyme Inhibition Constant Data from BindingDB
Found 2 hits for monomerid = 50366157
TargetProstaglandin G/H synthase 2(Homo sapiens (Human))
University Of Alberta
Curated by ChEMBL
LigandPNGBDBM50366157(CHEMBL1955883)
Affinity DataIC50:  1.50E+4nM. Assay description: Inhibition of human recombinant COX2 by fluorescence assay
In DepthDetails ArticlePubMed
TargetProstaglandin G/H synthase 1(Ovis aries (Sheep))
University Of Alberta
Curated by ChEMBL
LigandPNGBDBM50366157(CHEMBL1955883)
Affinity DataIC50:  5.00E+3nM. Assay description: Inhibition of ovine COX1 by fluorescence assay
In DepthDetails ArticlePubMed