BDBM50366201 CHEMBL1957599
SMILES ONC(=O)[C@@H]1CSCN1S(=O)(=O)c1ccc2ccccc2c1
InChI Key InChIKey=FEUGLHVWLKFXEV-ZDUSSCGKSA-N
Data  2 IC50
  Tab Delimited (TSV)   2D SDfile   Computed 3D by Vconf -m prep SDfile
Find this compound or compounds like it in BindingDB:
Activity Spreadsheet -- Enzyme Inhibition Constant Data from BindingDB
Found 2 hits for monomerid = 50366201
Target72 kDa type IV collagenase(Homo sapiens (Human))
Colosseum Combinatorial Chemistry Centre For Technology (C4T Scarl)
Curated by ChEMBL
LigandPNGBDBM50366201(CHEMBL1957599)
Affinity DataIC50:  3.10E+4nM. Assay description: Inhibition of full length MMP2 using Mca-Pro-Leu-Gly-Leu-Dpa-Ala-Arg-NH2 as substrate preincubated for 1 hr prior substrate addition measured after 3...
In DepthDetails ArticlePubMed
TargetMatrix metalloproteinase-9(Homo sapiens (Human))
Colosseum Combinatorial Chemistry Centre For Technology (C4T Scarl)
Curated by ChEMBL
LigandPNGBDBM50366201(CHEMBL1957599)
Affinity DataIC50: >5.00E+4nM. Assay description: Inhibition of MMP9 catalytic domain using Mca-Pro-Leu-Gly-Leu-Dpa-Ala-Arg-NH2 as substrate preincubated for 1 hr prior substrate addition measured af...
In DepthDetails ArticlePubMed