BDBM50366372 CHEMBL1793998
SMILES CC[C@H](C)[C@H](NC(=O)N(Cc1ccc(O)cc1)c1ccc(F)c(NC(=O)[C@H](CCCCN)NC(=O)OC(C)(C)C)c1)C(=O)N[C@@H](CC(C)C)C(O)=O
InChI Key InChIKey=UFAYBCJRXVTTCW-OTEZZXHMSA-N
Data  1 KI
  Tab Delimited (TSV)   2D SDfile   Computed 3D by Vconf -m prep SDfile
Find this compound or compounds like it in BindingDB:
Activity Spreadsheet -- Enzyme Inhibition Constant Data from BindingDB
Found 1 hit for monomerid = 50366372
TargetNeurotensin receptor type 1(Rattus norvegicus)
TBA
Curated by ChEMBL
LigandPNGBDBM50366372(CHEMBL1793998)
Affinity DataKi: >1.00E+4nM. Assay description: Tested for binding affinity against Neurotensin receptor
In DepthDetails Article