BDBM50366588 CHEMBL610876
SMILES NC(=N)NCCC[C@@H](NC(=O)[C@@H](CCCNC(N)=N)NC(=O)[C@@H](CCCNC(N)=N)NC(=O)[C@@H](CCCNC(N)=N)NC(=O)[C@@H](CCCNC(N)=N)NC(=O)[C@@H](CCCNC(N)=N)NC(=O)CCCCCCCNC(=O)[C@H]1OC([C@H](O)[C@@H]1O)n1cnc2c(N)ncnc12)C(O)=O
InChI Key InChIKey=HBUMOBPTTFUJHS-FIYJFMLKSA-N
Data  2 IC50
  Tab Delimited (TSV)   2D SDfile   Computed 3D by Vconf -m prep SDfile
Find this compound or compounds like it in BindingDB:
Activity Spreadsheet -- Enzyme Inhibition Constant Data from BindingDB
Found 2 hits for monomerid = 50366588
TargetCalcium dependent protein kinase(Zea mays)
Tartu University
Curated by ChEMBL
LigandPNGBDBM50366588(CHEMBL610876)
Affinity DataIC50:  3.20E+3nM. Assay description: Inhibition of Calcium-dependent protein kinase 1 (CDPK-1) from maize seedlings
In DepthDetails ArticlePubMed
TargetProtein kinase C beta type(Homo sapiens (Human))
Tartu University
Curated by ChEMBL
LigandPNGBDBM50366588(CHEMBL610876)
Affinity DataIC50:  140nM. Assay description: Inhibitory activity against Protein kinase C beta isoform (PKC) from pig spleen.
In DepthDetails ArticlePubMed