BDBM50366682 CHEMBL1627395
SMILES CC(C)N(C(C)C)C(=O)[C@H]1CC[C@H]2[C@@H]3CCc4cc(ccc4[C@H]3CC[C@]12C)C(O)=O
InChI Key InChIKey=VXKTZBKORWNMBL-OPMJLWCUSA-N
Data  2 KI  1 IC50
  Tab Delimited (TSV)   2D SDfile   Computed 3D by Vconf -m prep SDfile
Find this compound or compounds like it in BindingDB:
Activity Spreadsheet -- Enzyme Inhibition Constant Data from BindingDB
Found 3 hits for monomerid = 50366682
Target3-oxo-5-alpha-steroid 4-dehydrogenase 2(Homo sapiens (Human))
TBA
Curated by ChEMBL
LigandPNGBDBM50366682(CHEMBL1627395)
Affinity DataKi:  20nM. Assay description: Compound was tested for inhibitory activity against human prostatic Steroid 5-alpha-reductase
In DepthDetails Article
Target3-oxo-5-alpha-steroid 4-dehydrogenase 1/2(Rattus norvegicus)
Smith Kline & French Laboratories
Curated by ChEMBL
LigandPNGBDBM50366682(CHEMBL1627395)
Affinity DataKi:  356nM. Assay description: Inhibition of Steroid 5-alpha-reductase of rat ventral prostate tissue
In DepthDetails ArticlePubMed
Target3-oxo-5-alpha-steroid 4-dehydrogenase 2(Homo sapiens (Human))
TBA
Curated by ChEMBL
LigandPNGBDBM50366682(CHEMBL1627395)
Affinity DataIC50:  2.10nM. Assay description: Compound was tested for the inhibition of type 2 5-alpha-reductase of human prostates
In DepthDetails ArticlePubMed