BDBM50366992 CHEMBL4168754
SMILES [H][C@@]1(O[C@H]([C@H](O)[C@@H]1O)n1ccc2c(N)ncnc12)[C@H](O)c1ccccc1
InChI Key InChIKey=WWOOWAHTEXIWBO-QFRSUPTLSA-N
Data  3 IC50  1 Kd  1 EC50
PDB links: 1 PDB ID matches this monomer.
  Tab Delimited (TSV)   2D SDfile   Computed 3D by Vconf -m prep SDfile
Find this compound or compounds like it in BindingDB:
Activity Spreadsheet -- Enzyme Inhibition Constant Data from BindingDB
Found 5 hits for monomerid = 50366992
TargetMethylosome protein 50/Protein arginine N-methyltransferase 5(Homo sapiens (Human))
Lilly Research Laboratories
Curated by ChEMBL
LigandPNGBDBM50366992(CHEMBL4168754)
Affinity DataKd:  6nM. Assay description: Inhibition of PRMT5/MEP50 complex (unknown origin) expressed in Sf9 insect cells using SGRGKGGKGLGKGGAKRHRKVLRDK-Biotin as substrate by surface plasm...
TargetProtein arginine N-methyltransferase 5(Homo sapiens (Human))
Lilly Research Laboratories
Curated by ChEMBL
LigandPNGBDBM50366992(CHEMBL4168754)
Affinity DataIC50:  25nM. Assay description: Inhibition of PRMT5 in human MCF7 cells assessed as reduction in SmBB'-Rme2s levels after 48 hrs by Western blot analysis
TargetMethylosome protein 50/Protein arginine N-methyltransferase 5(Homo sapiens (Human))
Lilly Research Laboratories
Curated by ChEMBL
LigandPNGBDBM50366992(CHEMBL4168754)
Affinity DataIC50:  9.5nM. Assay description: Inhibition of recombinant human N-terminal FLAG-tagged PRMT5 (1 to 637 residue) /full length human N-terminal His tagged MEP50 expressed in baculovir...
TargetProtein arginine N-methyltransferase 5(Homo sapiens (Human))
Lilly Research Laboratories
Curated by ChEMBL
LigandPNGBDBM50366992(CHEMBL4168754)
Affinity DataEC50:  40nM. Assay description: Inhibition of PRMT5 in human MCF7 cells assessed as skipping of Mdm4 exon 6 mRNA splicing after 72 hrs by qRT-PCR method
TargetMethylosome protein 50/Protein arginine N-methyltransferase 5(Homo sapiens (Human))
Lilly Research Laboratories
Curated by ChEMBL
LigandPNGBDBM50366992(CHEMBL4168754)
Affinity DataIC50:  22nM. Assay description: Inhibition of PRMT5/MEP50 complex (unknown origin) expressed in Sf9 insect cells using SGRGKGGKGLGKGGAKRHRKVLRDK-Biotin as substrate measured after 2...