BDBM50367007 CHEMBL605641
SMILES OC1C(COP(O)(O)=O)OC(C1O)n1c(SCCc2ccc(cc2)[N+]([O-])=O)nc2c1nc[n-]c2=[OH+]
InChI Key InChIKey=WCHUQTCMGFRNAM-UHFFFAOYSA-N
Data  1 KI
  Tab Delimited (TSV)   2D SDfile   Computed 3D by Vconf -m prep SDfile
Find this compound or compounds like it in BindingDB:
Activity Spreadsheet -- Enzyme Inhibition Constant Data from BindingDB
Found 1 hit for monomerid = 50367007
TargetInosine-5'-monophosphate dehydrogenase(Escherichia coli (strain K12))
TBA
Curated by ChEMBL
LigandPNGBDBM50367007(CHEMBL605641)
Affinity DataKi:  5.40E+4nM. Assay description: Inhibition of inosine monophosphate dehydrogenase in Escherichia coli
In DepthDetails ArticlePubMed