BDBM50367011 CHEMBL606479
SMILES Nc1ncnc2n(C3O[C@H](COP(O)(O)=O)[C@@H](O)[C@H]3O)c(SCc3ccccc3)nc12
InChI Key InChIKey=TZBPBPNHWQIKEE-AARXTDBFSA-N
Data  1 KI
  Tab Delimited (TSV)   2D SDfile   Computed 3D by Vconf -m prep SDfile
Find this compound or compounds like it in BindingDB:
Activity Spreadsheet -- Enzyme Inhibition Constant Data from BindingDB
Found 1 hit for monomerid = 50367011
TargetInosine-5'-monophosphate dehydrogenase(Escherichia coli (strain K12))
TBA
Curated by ChEMBL
LigandPNGBDBM50367011(CHEMBL606479)
Affinity DataKi:  1.24E+5nM. Assay description: Inhibition of inosine monophosphate dehydrogenase in Escherichia coli
In DepthDetails ArticlePubMed