BDBM50367105 CHEMBL608209
SMILES COP(O)(=O)C[C@H]1OC([C@H](O)[C@@H]1O)n1cnc2c(N)ncnc12
InChI Key InChIKey=UOAHFGODJHOWHF-YNJARDAQSA-N
Data  1 KI
  Tab Delimited (TSV)   2D SDfile   Computed 3D by Vconf -m prep SDfile
Find this compound or compounds like it in BindingDB:
Activity Spreadsheet -- Enzyme Inhibition Constant Data from BindingDB
Found 1 hit for monomerid = 50367105
TargetAdenylate kinase isoenzyme 1(Rattus norvegicus)
TBA
Curated by ChEMBL
LigandPNGBDBM50367105(CHEMBL608209)
Affinity DataKi:  5.20E+7nM. Assay description: Noncompetitive inhibitory constant of compound with Rat adenylate kinase M isozyme
In DepthDetails ArticlePubMed