BDBM50367162 CHEMBL1744335
SMILES CC(CS)C(=O)N1C(Cc2cc3OCOc3cc12)C(O)=O
InChI Key InChIKey=IFGSVGTXHIPYDG-UHFFFAOYSA-N
Data  1 IC50
  Tab Delimited (TSV)   2D SDfile   Computed 3D by Vconf -m prep SDfile
Find this compound or compounds like it in BindingDB:
Activity Spreadsheet -- Enzyme Inhibition Constant Data from BindingDB
Found 1 hit for monomerid = 50367162
TargetAngiotensin-converting enzyme(Oryctolagus cuniculus)
TBA
Curated by ChEMBL
LigandPNGBDBM50367162(CHEMBL1744335)
Affinity DataIC50:  26nM. Assay description: In vitro inhibition of Angiotensin I converting enzyme
In DepthDetails ArticlePubMed