BDBM50367267 CHEMBL605246
SMILES OC[C@H]1OC([C@H](O)[C@@H]1O)n1cnc2c(Nc3ccc(CC(O)=O)cc3)ncnc12
InChI Key InChIKey=GDUNTDCJAUFXGG-HETNKJQDSA-N
Data  2 KI
  Tab Delimited (TSV)   2D SDfile   Computed 3D by Vconf -m prep SDfile
Find this compound or compounds like it in BindingDB:
Activity Spreadsheet -- Enzyme Inhibition Constant Data from BindingDB
Found 2 hits for monomerid = 50367267
TargetAdenosine receptor A1/A2a/A2b/A3(Rattus norvegicus (rat))
TBA
Curated by ChEMBL
LigandPNGBDBM50367267(CHEMBL605246)
Affinity DataKi:  210nM. Assay description: Ability to inhibit the binding of [3H]N6-phenylisopropyl adenosine to adenosine receptor in rat cerebral cortex membranes
In DepthDetails ArticlePubMed
TargetAdenosine receptor A1(Rattus norvegicus (rat))
TBA
Curated by ChEMBL
LigandPNGBDBM50367267(CHEMBL605246)
Affinity DataKi:  210nM. Assay description: Inhibition of binding of 1 nM N6-[3H]cyclohexyladenosine to adenosine A1 receptor on rat cerebral cortical membranes.
In DepthDetails ArticlePubMed