BDBM50367378 CHEMBL603362
SMILES CCC(CC)Nc1ncnc2n(cnc12)C1O[C@@H]([C@@H](O)[C@H]1O)C(=O)NC(C)C
InChI Key InChIKey=WPNYHTHRKZZXST-CDJKEZFESA-N
Data  1 IC50  1 EC50
  Tab Delimited (TSV)   2D SDfile   Computed 3D by Vconf -m prep SDfile
Find this compound or compounds like it in BindingDB:
Activity Spreadsheet -- Enzyme Inhibition Constant Data from BindingDB
Found 2 hits for monomerid = 50367378
TargetAdenosine receptor A2a/A2b(Rattus norvegicus)
TBA
Curated by ChEMBL
LigandPNGBDBM50367378(CHEMBL603362)
Affinity DataEC50:  5.10E+3nM. Assay description: Potency against PC12 cell A2 adenosine receptor by adenylate cyclase activation
In DepthDetails ArticlePubMed
TargetAdenosine receptor A1(Rattus norvegicus (rat))
TBA
Curated by ChEMBL
LigandPNGBDBM50367378(CHEMBL603362)
Affinity DataIC50:  11nM. Assay description: Potency against rat brain A1 adenosine receptor
In DepthDetails ArticlePubMed