BDBM50367439 CHEMBL1743954
SMILES C(Cc1ccccn1)N1CC(c2[nH]c3ccccc3c2C1)c1ccccc1
InChI Key InChIKey=BYEGRTMNNPHEQN-UHFFFAOYSA-N
Data  1 KI
  Tab Delimited (TSV)   2D SDfile   Computed 3D by Vconf -m prep SDfile
Find this compound or compounds like it in BindingDB:
Activity Spreadsheet -- Enzyme Inhibition Constant Data from BindingDB
Found 1 hit for monomerid = 50367439
TargetD(2) dopamine receptor(Rattus norvegicus (rat))
Wyeth Laboratories
Curated by ChEMBL
LigandPNGBDBM50367439(CHEMBL1743954)
Affinity DataKi:  600nM. Assay description: In vitro Dopamine receptor D2 affinity by using [3H]spiperone as the radioligand in rat limbic system at 1 uM concentration of compound ; value may r...
In DepthDetails ArticlePubMed