BDBM50367460 CHEMBL1202809
SMILES COc1cccc(Cc2nc3c(O)ccc(C)c3[nH]2)c1
InChI Key InChIKey=ONWHFDTUCGTYTP-UHFFFAOYSA-N
Data  1 IC50
  Tab Delimited (TSV)   2D SDfile   Computed 3D by Vconf -m prep SDfile
Find this compound or compounds like it in BindingDB:
Activity Spreadsheet -- Enzyme Inhibition Constant Data from BindingDB
Found 1 hit for monomerid = 50367460
TargetPolyunsaturated fatty acid 5-lipoxygenase(Rattus norvegicus)
Beecham Pharmaceuticals Research Division
Curated by ChEMBL
LigandPNGBDBM50367460(CHEMBL1202809)
Affinity DataIC50:  1.70E+3nM. Assay description: In vitro inhibition of RBL-1 5-lipoxygenase; Value ranges from 1.0-2.4
In DepthDetails ArticlePubMed