BDBM50367497 CHEMBL608217
SMILES OC[C@H]1OC([C@H](O)[C@@H]1O)n1cnc2c(Nc3cccc(c3)B(O)O)ncnc12
InChI Key InChIKey=RZZBKEJIVKIRHK-AARXTDBFSA-N
Data  2 IC50
  Tab Delimited (TSV)   2D SDfile   Computed 3D by Vconf -m prep SDfile
Find this compound or compounds like it in BindingDB:
Activity Spreadsheet -- Enzyme Inhibition Constant Data from BindingDB
Found 2 hits for monomerid = 50367497
TargetAdenosine receptor A2a/A2b(Rattus norvegicus)
TBA
Curated by ChEMBL
LigandPNGBDBM50367497(CHEMBL608217)
Affinity DataIC50:  9.30E+3nM. Assay description: Displacement of [3H]-NECA from adenosine A2 receptor of rat striatal membrane
In DepthDetails ArticlePubMed
TargetAdenosine receptor A1(Chick)
TBA
Curated by ChEMBL
LigandPNGBDBM50367497(CHEMBL608217)
Affinity DataIC50:  42nM. Assay description: Displacement of [125I]ABA from adenosine A1 receptor of chick cerebellar membrane
In DepthDetails ArticlePubMed